Information card for entry 7241906
Chemical name | catena-[tetrakis(u-cyano)-cyano-bis(1-methylimidazole)-nitrosyl-iron-cadmium] |
Formula | C13 H12 Cd Fe N10 O |
Calculated formula | C13 H12 Cd Fe N10 O |
Title of publication | A first exploration of isostructurality in transition metal nitroprussides: X-ray analysis, magnetic properties and DFT calculations |
Authors of publication | Pérez, Hiram; Di Santo, Alejandro; Piro, Oscar E.; Echeverría, Gustavo A.; Cano, A.; González, M.; Rodríguez-Hernández, J.; Ben Altabef, A.; Frontera, Antonio; Gil, Diego M. |
Journal of publication | CrystEngComm |
Year of publication | 2021 |
Journal volume | 23 |
Journal issue | 5 |
Pages of publication | 1158 - 1171 |
a | 8.4002 ± 0.0003 Å |
b | 15.2133 ± 0.0005 Å |
c | 14.896 ± 0.0005 Å |
α | 90° |
β | 98.048 ± 0.003° |
γ | 90° |
Cell volume | 1884.88 ± 0.11 Å3 |
Cell temperature | 297 ± 2 K |
Ambient diffraction temperature | 297 ± 2 K |
Number of distinct elements | 6 |
Space group number | 14 |
Hermann-Mauguin space group symbol | P 1 21/c 1 |
Hall space group symbol | -P 2ybc |
Residual factor for all reflections | 0.067 |
Residual factor for significantly intense reflections | 0.0387 |
Weighted residual factors for significantly intense reflections | 0.0818 |
Weighted residual factors for all reflections included in the refinement | 0.0974 |
Goodness-of-fit parameter for all reflections included in the refinement | 1.033 |
Diffraction radiation probe | x-ray |
Diffraction radiation wavelength | 0.71073 Å |
Diffraction radiation type | MoKα |