Information card for entry 7241909
Common name | 4-Methylpiperidine_hemihydrate |
Formula | C6 H14 N O0.5 |
Calculated formula | C6 H14 N O0.5 |
SMILES | O.N1CCC(CC1)C |
Title of publication | Intermolecular interactions in hydrates of 4-methylpiperidine and 4-chloropiperidine – a structural and computational study |
Authors of publication | Socha, Paweł; Prus, Bernadeta; Dobrzycki, Łukasz; Boese, Roland; Cyrański, Michał K. |
Journal of publication | CrystEngComm |
Year of publication | 2021 |
Journal volume | 23 |
Journal issue | 5 |
Pages of publication | 1251 - 1262 |
a | 5.3056 ± 0.0004 Å |
b | 23.544 ± 0.002 Å |
c | 11.1942 ± 0.001 Å |
α | 90° |
β | 99.188 ± 0.002° |
γ | 90° |
Cell volume | 1380.4 ± 0.2 Å3 |
Cell temperature | 100 ± 2 K |
Ambient diffraction temperature | 100 ± 2 K |
Number of distinct elements | 4 |
Space group number | 14 |
Hermann-Mauguin space group symbol | P 1 21/c 1 |
Hall space group symbol | -P 2ybc |
Residual factor for all reflections | 0.0626 |
Residual factor for significantly intense reflections | 0.0525 |
Weighted residual factors for significantly intense reflections | 0.1184 |
Weighted residual factors for all reflections included in the refinement | 0.124 |
Goodness-of-fit parameter for all reflections included in the refinement | 1.116 |
Diffraction radiation wavelength | 0.71073 Å |
Diffraction radiation type | MoKα |