Information card for entry 7241950
Formula | C12 H8 Cl5 N O |
Calculated formula | C12 H8 Cl5 N O |
SMILES | Clc1c(O)c(Cl)c(Cl)c(Cl)c1Cl.n1ccc(cc1)C |
Title of publication | Suppression of isotopic polymorphism |
Authors of publication | Funnell, Nicholas P.; Allan, David R.; Maloney, Andrew G. P.; Smith, Ronald I.; Wilson, Cameron J. G.; Parsons, Simon |
Journal of publication | CrystEngComm |
Year of publication | 2021 |
Journal volume | 23 |
Journal issue | 4 |
Pages of publication | 769 - 776 |
a | 7.3014 ± 0.00003 Å |
b | 8.7017 ± 0.00007 Å |
c | 13.2339 ± 0.00007 Å |
α | 100.09 ± 0.011° |
β | 117.346 ± 0.007° |
γ | 104.142 ± 0.008° |
Cell volume | 682.7 ± 0.09 Å3 |
Cell temperature | 293 K |
Ambient diffraction temperature | 293 K |
Cell measurement pressure | 0.57 kPa |
Number of distinct elements | 5 |
Space group number | 2 |
Hermann-Mauguin space group symbol | P -1 |
Hall space group symbol | -P 1 |
Residual factor for all reflections | 0.1378 |
Residual factor for significantly intense reflections | 0.1187 |
Weighted residual factors for all reflections | 0.4324 |
Weighted residual factors for significantly intense reflections | 0.4062 |
Weighted residual factors for all reflections included in the refinement | 0.4324 |
Goodness-of-fit parameter for all reflections included in the refinement | 1.9981 |
Diffraction radiation wavelength | 0.6889 Å |
Diffraction radiation type | synchrotron |