Information card for entry 7241955
Formula | C12 H8 Cl5 N O |
Calculated formula | C12 H8 Cl5 N O |
SMILES | Clc1c(O)c(Cl)c(Cl)c(Cl)c1Cl.n1ccc(cc1)C |
Title of publication | Suppression of isotopic polymorphism |
Authors of publication | Funnell, Nicholas P.; Allan, David R.; Maloney, Andrew G. P.; Smith, Ronald I.; Wilson, Cameron J. G.; Parsons, Simon |
Journal of publication | CrystEngComm |
Year of publication | 2021 |
Journal volume | 23 |
Journal issue | 4 |
Pages of publication | 769 - 776 |
a | 7.029 ± 0.00003 Å |
b | 8.0085 ± 0.00006 Å |
c | 12.0805 ± 0.00006 Å |
α | 101.11 ± 0.01° |
β | 114.232 ± 0.007° |
γ | 104.203 ± 0.008° |
Cell volume | 567.09 ± 0.07 Å3 |
Cell temperature | 293 K |
Ambient diffraction temperature | 293 K |
Cell measurement pressure | 4.57 kPa |
Number of distinct elements | 5 |
Space group number | 2 |
Hermann-Mauguin space group symbol | P -1 |
Hall space group symbol | -P 1 |
Residual factor for all reflections | 0.1564 |
Residual factor for significantly intense reflections | 0.1352 |
Weighted residual factors for all reflections | 0.4498 |
Weighted residual factors for significantly intense reflections | 0.4244 |
Weighted residual factors for all reflections included in the refinement | 0.4498 |
Goodness-of-fit parameter for all reflections included in the refinement | 1.9834 |
Diffraction radiation wavelength | 0.6889 Å |
Diffraction radiation type | synchrotron |