Information card for entry 7241969
Formula | C20 H40 N6 O12 S2 |
Calculated formula | C20 H40 N6 O12 S2 |
Title of publication | Dynamic structural reconstruction of (guanidinium+)2(benzene-1,4-disulfonate2−) host crystal by guest adsorption |
Authors of publication | Abe, Haruka; Kobayashi, Takahiro; Hoshino, Norihisa; Takeda, Takashi; Suzuki, Yasutaka; Kawamata, Jun; Akutagawa, Tomoyuki |
Journal of publication | CrystEngComm |
Year of publication | 2021 |
Journal volume | 23 |
Journal issue | 5 |
Pages of publication | 1149 - 1157 |
a | 7.6145 ± 0.0003 Å |
b | 12.323 ± 0.0005 Å |
c | 15.6653 ± 0.0005 Å |
α | 90° |
β | 101.077 ± 0.002° |
γ | 90° |
Cell volume | 1442.54 ± 0.09 Å3 |
Cell temperature | 100 K |
Ambient diffraction temperature | 100 K |
Number of distinct elements | 5 |
Space group number | 14 |
Hermann-Mauguin space group symbol | P 1 21/n 1 |
Hall space group symbol | -P 2yn |
Residual factor for all reflections | 0.0735 |
Residual factor for significantly intense reflections | 0.0581 |
Weighted residual factors for significantly intense reflections | 0.1418 |
Weighted residual factors for all reflections included in the refinement | 0.1535 |
Goodness-of-fit parameter for all reflections included in the refinement | 1.009 |
Diffraction radiation wavelength | 1.54187 Å |
Diffraction radiation type | CuKα |