Information card for entry 7241980
Formula | C9 H11 Br0.25 Cl0.75 N O2 |
Calculated formula | C9 H10 Br0.25 Cl0.75 N O2 |
Title of publication | The impact of solid solution composition on kinetics and mechanism of [2 + 2] photodimerization of cinnamic acid derivatives |
Authors of publication | Pandolfi, Lorenzo; Giunchi, Andrea; Salzillo, Tommaso; Brillante, Aldo; Della Valle, Raffaele G.; Venuti, Elisabetta; Grepioni, Fabrizia; D'Agostino, Simone |
Journal of publication | CrystEngComm |
Year of publication | 2021 |
Journal volume | 23 |
Journal issue | 6 |
Pages of publication | 1352 - 1359 |
a | 5.8421 ± 0.0007 Å |
b | 8.2764 ± 0.0014 Å |
c | 18.838 ± 0.003 Å |
α | 90° |
β | 92.673 ± 0.013° |
γ | 90° |
Cell volume | 909.9 ± 0.2 Å3 |
Cell temperature | 300 K |
Ambient diffraction temperature | 300 K |
Number of distinct elements | 6 |
Space group number | 14 |
Hermann-Mauguin space group symbol | P 1 21/c 1 |
Hall space group symbol | -P 2ybc |
Residual factor for all reflections | 0.1398 |
Residual factor for significantly intense reflections | 0.0898 |
Weighted residual factors for significantly intense reflections | 0.2217 |
Weighted residual factors for all reflections included in the refinement | 0.2608 |
Goodness-of-fit parameter for all reflections included in the refinement | 1.089 |
Diffraction radiation probe | x-ray |
Diffraction radiation wavelength | 0.71073 Å |
Diffraction radiation type | MoKα |