Information card for entry 7242019
Formula | Mo4 O15 Y2 |
Calculated formula | Mo4 O15 Y2 |
Title of publication | Design, growth, and characterization of Y2Mo4O15 crystals for Raman laser applications |
Authors of publication | Wang, Xiangmei; Gao, Zeliang; Wang, Chunyan; Guo, Xiaojie; Sun, Youxuan; Jia, Yu; Tao, Xutang |
Journal of publication | RSC Advances |
Year of publication | 2021 |
Journal volume | 11 |
Journal issue | 2 |
Pages of publication | 1164 - 1171 |
a | 6.811 ± 0.0004 Å |
b | 9.5833 ± 0.0006 Å |
c | 10.5124 ± 0.0007 Å |
α | 90° |
β | 105.512 ± 0.007° |
γ | 90° |
Cell volume | 661.17 ± 0.08 Å3 |
Cell temperature | 292.99 ± 0.1 K |
Ambient diffraction temperature | 292.99 ± 0.1 K |
Number of distinct elements | 3 |
Space group number | 14 |
Hermann-Mauguin space group symbol | P 1 21/c 1 |
Hall space group symbol | -P 2ybc |
Residual factor for all reflections | 0.0563 |
Residual factor for significantly intense reflections | 0.0531 |
Weighted residual factors for significantly intense reflections | 0.128 |
Weighted residual factors for all reflections included in the refinement | 0.1306 |
Goodness-of-fit parameter for all reflections included in the refinement | 1.076 |
Diffraction radiation probe | x-ray |
Diffraction radiation wavelength | 0.71073 Å |
Diffraction radiation type | MoKα |