Information card for entry 7242024
Formula | C50 H36 N2 Na4 O10 |
Calculated formula | C50 H36 N2 Na4 O10 |
Title of publication | Structural modulation of the photophysical and electronic properties of pyrene-based 3D metal‒organic frameworks derived from s-block metals |
Authors of publication | Coleman, Christopher N.; Tapping, Patrick C.; Huxley, Michael T.; Kee, Tak W.; Huang, David M.; Doonan, Christian J.; Sumby, Christopher J. |
Journal of publication | CrystEngComm |
Year of publication | 2021 |
Journal volume | 23 |
Journal issue | 1 |
Pages of publication | 82 - 90 |
a | 21.718 ± 0.0013 Å |
b | 7.8066 ± 0.0006 Å |
c | 24.1817 ± 0.0017 Å |
α | 90° |
β | 90.887 ± 0.006° |
γ | 90° |
Cell volume | 4099.4 ± 0.5 Å3 |
Cell temperature | 150 ± 0.02 K |
Ambient diffraction temperature | 150 ± 0.02 K |
Number of distinct elements | 5 |
Space group number | 14 |
Hermann-Mauguin space group symbol | P 1 21/n 1 |
Hall space group symbol | -P 2yn |
Residual factor for all reflections | 0.2167 |
Residual factor for significantly intense reflections | 0.1321 |
Weighted residual factors for significantly intense reflections | 0.3476 |
Weighted residual factors for all reflections included in the refinement | 0.3874 |
Goodness-of-fit parameter for all reflections included in the refinement | 1.119 |
Diffraction radiation probe | x-ray |
Diffraction radiation wavelength | 0.71073 Å |
Diffraction radiation type | MoKα |