Information card for entry 7242044
Formula | C27 H18 N3 O9 Zn2 |
Calculated formula | C27 H18 N3 O9 Zn2 |
Title of publication | Four dual-functional luminescent Zn(ii)-MOFs based on 1,2,4,5-benzenetetracarboxylic acid with pyridylbenzimidazole ligands for detection of iron(iii) ions and acetylacetone |
Authors of publication | Shi, Yong-Sheng; Yu, Qiang; Zhang, Jian-Wei; Cui, Guang-Hua |
Journal of publication | CrystEngComm |
Year of publication | 2021 |
Journal volume | 23 |
Journal issue | 7 |
Pages of publication | 1604 - 1615 |
a | 8.478 ± 0.0002 Å |
b | 11.9324 ± 0.0003 Å |
c | 13.6431 ± 0.0003 Å |
α | 105.021 ± 0.002° |
β | 101.269 ± 0.002° |
γ | 105.692 ± 0.003° |
Cell volume | 1229.9 ± 0.06 Å3 |
Cell temperature | 293 ± 2 K |
Ambient diffraction temperature | 293 ± 2 K |
Number of distinct elements | 5 |
Space group number | 2 |
Hermann-Mauguin space group symbol | P -1 |
Hall space group symbol | -P 1 |
Residual factor for all reflections | 0.0762 |
Residual factor for significantly intense reflections | 0.0485 |
Weighted residual factors for significantly intense reflections | 0.1301 |
Weighted residual factors for all reflections included in the refinement | 0.1428 |
Goodness-of-fit parameter for all reflections included in the refinement | 1.077 |
Diffraction radiation wavelength | 0.71073 Å |
Diffraction radiation type | MoKα |