Information card for entry 7242046
Formula | C34 H52 Ag2 N6 O6 Si4 |
Calculated formula | C34 H52 Ag2 N6 O6 Si4 |
Title of publication | Supramolecular isomerism between cyclodimeric and sinusoidal 1D coordination polymers: competition of tunable argentophilic vs. electrostatic interactions |
Authors of publication | Moon, Heehun; Lim, Sang Woo; Kim, Dongwon; Jung, Ok-Sang; Lee, Young-A |
Journal of publication | CrystEngComm |
Year of publication | 2021 |
Journal volume | 23 |
Journal issue | 5 |
Pages of publication | 1272 - 1280 |
a | 15.1093 ± 0.0007 Å |
b | 17.6849 ± 0.0007 Å |
c | 8.2597 ± 0.0003 Å |
α | 90° |
β | 100.468 ± 0.003° |
γ | 90° |
Cell volume | 2170.31 ± 0.16 Å3 |
Cell temperature | 173 ± 2 K |
Ambient diffraction temperature | 173 ± 2 K |
Number of distinct elements | 6 |
Space group number | 12 |
Hermann-Mauguin space group symbol | C 1 2/m 1 |
Hall space group symbol | -C 2y |
Residual factor for all reflections | 0.0263 |
Residual factor for significantly intense reflections | 0.0237 |
Weighted residual factors for significantly intense reflections | 0.0601 |
Weighted residual factors for all reflections included in the refinement | 0.0623 |
Goodness-of-fit parameter for all reflections included in the refinement | 1.14 |
Diffraction radiation wavelength | 0.71073 Å |
Diffraction radiation type | MoKα |