Information card for entry 7242048
Formula | C17 H26 Ag B F4 N2 Si2 |
Calculated formula | C17 H26 Ag B F4 N2 Si2 |
Title of publication | Supramolecular isomerism between cyclodimeric and sinusoidal 1D coordination polymers: competition of tunable argentophilic vs. electrostatic interactions |
Authors of publication | Moon, Heehun; Lim, Sang Woo; Kim, Dongwon; Jung, Ok-Sang; Lee, Young-A |
Journal of publication | CrystEngComm |
Year of publication | 2021 |
Journal volume | 23 |
Journal issue | 5 |
Pages of publication | 1272 - 1280 |
a | 13.1079 ± 0.0003 Å |
b | 12.2055 ± 0.0004 Å |
c | 14.7073 ± 0.0004 Å |
α | 90° |
β | 106.888 ± 0.002° |
γ | 90° |
Cell volume | 2251.52 ± 0.11 Å3 |
Cell temperature | 173 ± 2 K |
Ambient diffraction temperature | 173 ± 2 K |
Number of distinct elements | 7 |
Space group number | 14 |
Hermann-Mauguin space group symbol | P 1 21/n 1 |
Hall space group symbol | -P 2yn |
Residual factor for all reflections | 0.0908 |
Residual factor for significantly intense reflections | 0.0596 |
Weighted residual factors for significantly intense reflections | 0.1513 |
Weighted residual factors for all reflections included in the refinement | 0.1756 |
Goodness-of-fit parameter for all reflections included in the refinement | 1.022 |
Diffraction radiation wavelength | 0.71073 Å |
Diffraction radiation type | MoKα |