Information card for entry 7242050
Formula | C17 H26 Ag Cl N2 O4 Si2 |
Calculated formula | C17 H26 Ag Cl N2 O4 Si2 |
Title of publication | Supramolecular isomerism between cyclodimeric and sinusoidal 1D coordination polymers: competition of tunable argentophilic vs. electrostatic interactions |
Authors of publication | Moon, Heehun; Lim, Sang Woo; Kim, Dongwon; Jung, Ok-Sang; Lee, Young-A |
Journal of publication | CrystEngComm |
Year of publication | 2021 |
Journal volume | 23 |
Journal issue | 5 |
Pages of publication | 1272 - 1280 |
a | 13.055 ± 0.003 Å |
b | 12.393 ± 0.003 Å |
c | 14.789 ± 0.003 Å |
α | 90° |
β | 106.13 ± 0.03° |
γ | 90° |
Cell volume | 2298.5 ± 1 Å3 |
Cell temperature | 253 ± 2 K |
Ambient diffraction temperature | 253 ± 2 K |
Number of distinct elements | 7 |
Space group number | 14 |
Hermann-Mauguin space group symbol | P 1 21/n 1 |
Hall space group symbol | -P 2yn |
Residual factor for all reflections | 0.0634 |
Residual factor for significantly intense reflections | 0.0525 |
Weighted residual factors for significantly intense reflections | 0.1785 |
Weighted residual factors for all reflections included in the refinement | 0.1881 |
Goodness-of-fit parameter for all reflections included in the refinement | 1.055 |
Diffraction radiation wavelength | 0.65 Å |
Diffraction radiation type | synchrotron |