Information card for entry 7242057
Formula | C16 H16.67 Br1.33 Cl0.67 N2.67 O2 S0.67 |
Calculated formula | C16 H16.6667 Br1.33333 Cl0.666667 N2.66667 O2 S0.666667 |
Title of publication | Solid-phase reactive chromatography (SPRC): a sustainable method for the synthesis of benzimidazol-diphenyl-2-imino-thiazolidine-4-ols (hemiaminals) which are active against lung cancer |
Authors of publication | Bangade, V. M.; Mali, P. R.; Meshram, H. M. |
Journal of publication | RSC Advances |
Year of publication | 2021 |
Journal volume | 11 |
Journal issue | 4 |
Pages of publication | 2320 - 2324 |
a | 7.9404 ± 0.0008 Å |
b | 11.6089 ± 0.0014 Å |
c | 15.724 ± 0.0018 Å |
α | 71.877 ± 0.01° |
β | 79.537 ± 0.009° |
γ | 78.741 ± 0.01° |
Cell volume | 1339.6 ± 0.3 Å3 |
Cell temperature | 293 ± 2 K |
Ambient diffraction temperature | 293 ± 2 K |
Number of distinct elements | 7 |
Space group number | 2 |
Hermann-Mauguin space group symbol | P -1 |
Hall space group symbol | -P 1 |
Residual factor for all reflections | 0.0874 |
Residual factor for significantly intense reflections | 0.064 |
Weighted residual factors for significantly intense reflections | 0.1851 |
Weighted residual factors for all reflections included in the refinement | 0.2408 |
Goodness-of-fit parameter for all reflections included in the refinement | 1.192 |
Diffraction radiation wavelength | 1.54184 Å |
Diffraction radiation type | CuKα |