Information card for entry 7242071
Formula | C13 H9 N O3 |
Calculated formula | C13 H9 N O3 |
Title of publication | Simple and efficient syntheses of 2-hydroxy-3H-phenoxazin-3-ones by aerobic oxidative cross-cyclocondensation in water |
Authors of publication | Li, Wenhao; Duan, Wenxue; Tang, Qingxuan; Li, Zhan-Ting; Yang, Guanyu |
Journal of publication | Green Chemistry |
Year of publication | 2021 |
Journal volume | 23 |
Journal issue | 3 |
Pages of publication | 1136 - 1139 |
a | 7.6718 ± 0.0015 Å |
b | 7.8925 ± 0.0013 Å |
c | 10.0037 ± 0.0014 Å |
α | 71.388 ± 0.014° |
β | 80.879 ± 0.014° |
γ | 66.502 ± 0.017° |
Cell volume | 526.1 ± 0.17 Å3 |
Cell temperature | 293 ± 2 K |
Ambient diffraction temperature | 293 ± 2 K |
Number of distinct elements | 4 |
Space group number | 2 |
Hermann-Mauguin space group symbol | P -1 |
Hall space group symbol | -P 1 |
Residual factor for all reflections | 0.0732 |
Residual factor for significantly intense reflections | 0.0472 |
Weighted residual factors for significantly intense reflections | 0.1264 |
Weighted residual factors for all reflections included in the refinement | 0.1481 |
Goodness-of-fit parameter for all reflections included in the refinement | 1.025 |
Diffraction radiation probe | x-ray |
Diffraction radiation wavelength | 1.54184 Å |
Diffraction radiation type | CuKα |