Information card for entry 7242113
Formula | C22 H26 Co N4 O8 |
Calculated formula | C22 H26 Co N4 O8 |
Title of publication | Structural diversity and photocatalytic activity of six Co(ii)/Ni(ii) complexes with three flexible phenylenediacetate isomers |
Authors of publication | Zhang, Mei-Li; Bai, Ye; Ren, Yi-Xia; Wang, Ji-Jiang; Yang, Xiao-Gang; Ma, Lu-Fang |
Journal of publication | CrystEngComm |
Year of publication | 2021 |
Journal volume | 23 |
Journal issue | 7 |
Pages of publication | 1616 - 1627 |
a | 5.5521 ± 0.0017 Å |
b | 10.63 ± 0.003 Å |
c | 10.978 ± 0.003 Å |
α | 66.111 ± 0.004° |
β | 87.833 ± 0.005° |
γ | 80.289 ± 0.005° |
Cell volume | 583.6 ± 0.3 Å3 |
Cell temperature | 296 ± 2 K |
Ambient diffraction temperature | 296 ± 2 K |
Number of distinct elements | 5 |
Space group number | 2 |
Hermann-Mauguin space group symbol | P -1 |
Hall space group symbol | -P 1 |
Residual factor for all reflections | 0.0438 |
Residual factor for significantly intense reflections | 0.0381 |
Weighted residual factors for significantly intense reflections | 0.1226 |
Weighted residual factors for all reflections included in the refinement | 0.1391 |
Goodness-of-fit parameter for all reflections included in the refinement | 1.209 |
Diffraction radiation wavelength | 0.71073 Å |
Diffraction radiation type | MoKα |