Information card for entry 7242127
Formula | C56 H80 O8 |
Calculated formula | C56 H80 O8 |
Title of publication | Conformational switch in the crystal states of a calix[4]arene |
Authors of publication | Mirzaei, Saber; Lindeman, Sergey V.; Wang, Denan; Mirzaei, M. Saeed; Timerghazin, Qadir K. |
Journal of publication | CrystEngComm |
Year of publication | 2021 |
Journal volume | 23 |
Journal issue | 9 |
Pages of publication | 1906 - 1911 |
a | 12.6612 ± 0.0004 Å |
b | 14.1198 ± 0.0003 Å |
c | 15.7544 ± 0.0004 Å |
α | 104.714 ± 0.002° |
β | 96.728 ± 0.002° |
γ | 99.499 ± 0.002° |
Cell volume | 2649.14 ± 0.13 Å3 |
Cell temperature | 250 ± 0.14 K |
Ambient diffraction temperature | 250 ± 0.14 K |
Number of distinct elements | 3 |
Space group number | 2 |
Hermann-Mauguin space group symbol | P -1 |
Hall space group symbol | -P 1 |
Residual factor for all reflections | 0.0844 |
Residual factor for significantly intense reflections | 0.0748 |
Weighted residual factors for significantly intense reflections | 0.246 |
Weighted residual factors for all reflections included in the refinement | 0.2636 |
Goodness-of-fit parameter for all reflections included in the refinement | 1.065 |
Diffraction radiation probe | x-ray |
Diffraction radiation wavelength | 1.54184 Å |
Diffraction radiation type | CuKα |