Information card for entry 7242130
Formula | C11 H16 N2 O2 S |
Calculated formula | C11 H16 N2 O2 S |
Title of publication | Non-covalent interactions involving remote substituents influence the topologies of supramolecular chains featuring hydroxyl-O‒H⋯O(hydroxyl) hydrogen bonding in crystals of (HOCH2CH2)2NC(S)N(H)(C6H4Y-4) for Y = H, Me, Cl and NO2 |
Authors of publication | Tan, Sang Loon; Tiekink, Edward R. T. |
Journal of publication | CrystEngComm |
Year of publication | 2021 |
Journal volume | 23 |
Journal issue | 8 |
Pages of publication | 1723 - 1743 |
a | 13.4885 ± 0.0001 Å |
b | 11.1767 ± 0.0001 Å |
c | 16.4909 ± 0.0002 Å |
α | 90° |
β | 98.544 ± 0.001° |
γ | 90° |
Cell volume | 2458.53 ± 0.04 Å3 |
Cell temperature | 100 ± 2 K |
Ambient diffraction temperature | 100 ± 2 K |
Number of distinct elements | 5 |
Space group number | 14 |
Hermann-Mauguin space group symbol | P 1 21/n 1 |
Hall space group symbol | -P 2yn |
Residual factor for all reflections | 0.0323 |
Residual factor for significantly intense reflections | 0.0304 |
Weighted residual factors for significantly intense reflections | 0.0765 |
Weighted residual factors for all reflections included in the refinement | 0.0778 |
Goodness-of-fit parameter for all reflections included in the refinement | 1.054 |
Diffraction radiation wavelength | 1.54184 Å |
Diffraction radiation type | CuKα |