Information card for entry 7242134
Chemical name | 2,4,6-triamino-1,3,5-triazine-1,3-dioxide tetrahydrate |
Formula | C3 H14 N6 O6 |
Calculated formula | C3 H14 N6 O6 |
SMILES | O=n1c(N)n(=O)c(N)nc1N.O.O.O.O |
Title of publication | Adjacent N→O and C‒NH2 groups — a highly efficient amphoteric structure for energetic materials resulting from tautomerization proved by crystal engineering |
Authors of publication | Feng, Zhicun; Zhang, Yu; Li, Yanan; Xu, Kangzhen |
Journal of publication | CrystEngComm |
Year of publication | 2021 |
Journal volume | 23 |
Journal issue | 7 |
Pages of publication | 1544 - 1549 |
a | 8.972 ± 0.006 Å |
b | 7.067 ± 0.005 Å |
c | 16.369 ± 0.01 Å |
α | 90° |
β | 94.273 ± 0.011° |
γ | 90° |
Cell volume | 1035 ± 1.2 Å3 |
Cell temperature | 296 ± 2 K |
Ambient diffraction temperature | 296 ± 2 K |
Number of distinct elements | 4 |
Space group number | 14 |
Hermann-Mauguin space group symbol | P 1 21/n 1 |
Hall space group symbol | -P 2yn |
Residual factor for all reflections | 0.0616 |
Residual factor for significantly intense reflections | 0.0433 |
Weighted residual factors for significantly intense reflections | 0.1122 |
Weighted residual factors for all reflections included in the refinement | 0.1237 |
Goodness-of-fit parameter for all reflections included in the refinement | 1.014 |
Diffraction radiation wavelength | 0.71073 Å |
Diffraction radiation type | MoKα |