Information card for entry 7242154
Formula | C22 H38 O4 Sn |
Calculated formula | C22 H38 O4 Sn |
Title of publication | New triorganotin(iv) compounds with aromatic carboxylate ligands: synthesis and evaluation of the pro-apoptotic mechanism |
Authors of publication | Rashid, Faisal; Uddin, Noor; Ali, Saqib; Haider, Ali; Tirmizi, Syed Ahmad; Diaconescu, Paula L.; Iqbal, Jamshed |
Journal of publication | RSC Advances |
Year of publication | 2021 |
Journal volume | 11 |
Journal issue | 8 |
Pages of publication | 4499 - 4514 |
a | 26.639 ± 0.003 Å |
b | 10.7495 ± 0.0011 Å |
c | 16.3176 ± 0.0016 Å |
α | 90° |
β | 98.1189 ± 0.0016° |
γ | 90° |
Cell volume | 4625.8 ± 0.8 Å3 |
Cell temperature | 100 ± 2 K |
Ambient diffraction temperature | 100 ± 2 K |
Number of distinct elements | 4 |
Space group number | 14 |
Hermann-Mauguin space group symbol | P 1 21/c 1 |
Hall space group symbol | -P 2ybc |
Residual factor for all reflections | 0.0759 |
Residual factor for significantly intense reflections | 0.0574 |
Weighted residual factors for significantly intense reflections | 0.1271 |
Weighted residual factors for all reflections included in the refinement | 0.1396 |
Goodness-of-fit parameter for all reflections included in the refinement | 1.214 |
Diffraction radiation wavelength | 0.71073 Å |
Diffraction radiation type | MoKα |