Information card for entry 7242169
Formula | C31 H45 Co N5 O4 P2 S4 |
Calculated formula | C31 H45 Co N5 O4 P2 S4 |
Title of publication | Supramolecular chirality in the crystals of mononuclear and polymeric cobalt(ii) complexes with enantiopure and racemic N-thiophosphorylated thioureas |
Authors of publication | Kataeva, Olga; Metlushka, Kirill; Ivshin, Kamil; Yamaleeva, Zilya; Zinnatullin, Ruzal; Nikitina, Kristina; Badeeva, Elena; Khrizanforova, Vera; Budnikova, Yulia; Naumann, Marco; Wellm, Christoph; Alfonsov, Alexey; Kataev, Vladislav; Büchner, Bernd; Knupfer, Martin |
Journal of publication | CrystEngComm |
Year of publication | 2021 |
Journal volume | 23 |
Journal issue | 10 |
Pages of publication | 2081 - 2090 |
a | 23.624 ± 0.005 Å |
b | 9.1342 ± 0.0019 Å |
c | 18.34 ± 0.004 Å |
α | 90° |
β | 102.254 ± 0.008° |
γ | 90° |
Cell volume | 3867.4 ± 1.4 Å3 |
Cell temperature | 100 ± 2 K |
Ambient diffraction temperature | 100 ± 2 K |
Number of distinct elements | 7 |
Space group number | 15 |
Hermann-Mauguin space group symbol | C 1 2/c 1 |
Hall space group symbol | -C 2yc |
Residual factor for all reflections | 0.1191 |
Residual factor for significantly intense reflections | 0.061 |
Weighted residual factors for significantly intense reflections | 0.1456 |
Weighted residual factors for all reflections included in the refinement | 0.177 |
Goodness-of-fit parameter for all reflections included in the refinement | 1.035 |
Diffraction radiation wavelength | 0.71073 Å |
Diffraction radiation type | MoKα |