Information card for entry 7242171
Formula | C30 H24 N6 Ru Se9 Sn4 |
Calculated formula | C30 H24 N6 Ru Se9 Sn4 |
Title of publication | Coupling an organic photosensitizer and an inorganic framework into a single-phase material that shows visible-light photocurrent response |
Authors of publication | Zhang, Tao; Hu, Yue-Qiao; Li, Qian-Wen; Chen, Wei-Peng; Zheng, Yan-Zhen |
Journal of publication | CrystEngComm |
Year of publication | 2021 |
Journal volume | 23 |
Journal issue | 9 |
Pages of publication | 1881 - 1884 |
a | 27.2403 ± 0.001 Å |
b | 27.2403 ± 0.001 Å |
c | 31.01 ± 0.002 Å |
α | 90° |
β | 90° |
γ | 120° |
Cell volume | 19927.7 ± 1.6 Å3 |
Cell temperature | 296 ± 2 K |
Ambient diffraction temperature | 296.15 K |
Number of distinct elements | 6 |
Space group number | 161 |
Hermann-Mauguin space group symbol | R 3 c :H |
Hall space group symbol | R 3 -2"c |
Residual factor for all reflections | 0.0317 |
Residual factor for significantly intense reflections | 0.0293 |
Weighted residual factors for significantly intense reflections | 0.0711 |
Weighted residual factors for all reflections included in the refinement | 0.0726 |
Goodness-of-fit parameter for all reflections included in the refinement | 1.031 |
Diffraction radiation wavelength | 0.71073 Å |
Diffraction radiation type | MoKα |