Information card for entry 7242175
Formula | C16 H16 N2 O10 Zn |
Calculated formula | C16 H16 N2 O10 Zn |
Title of publication | Ferromagnetic coupling in a dicopper(ii) oxamate complex bridged by carboxylate groups |
Authors of publication | da Cunha, Tamyris T.; da Silveira, Cleverton O. C.; Barbosa, Vitor M. M.; Oliveira, Willian X. C.; da Silva Júnior, Eufrânio N.; Ferreira, Fabio F.; Pedroso, Emerson F.; Pereira, Cynthia L. M. |
Journal of publication | CrystEngComm |
Year of publication | 2021 |
Journal volume | 23 |
Journal issue | 9 |
Pages of publication | 1885 - 1897 |
a | 12.3838 ± 0.0006 Å |
b | 7.2105 ± 0.0003 Å |
c | 20.8942 ± 0.0009 Å |
α | 90° |
β | 105.847 ± 0.005° |
γ | 90° |
Cell volume | 1794.81 ± 0.15 Å3 |
Cell temperature | 150 ± 2 K |
Ambient diffraction temperature | 150 ± 2 K |
Number of distinct elements | 5 |
Space group number | 15 |
Hermann-Mauguin space group symbol | C 1 2/c 1 |
Hall space group symbol | -C 2yc |
Residual factor for all reflections | 0.0276 |
Residual factor for significantly intense reflections | 0.025 |
Weighted residual factors for significantly intense reflections | 0.063 |
Weighted residual factors for all reflections included in the refinement | 0.0645 |
Goodness-of-fit parameter for all reflections included in the refinement | 1.11 |
Diffraction radiation wavelength | 0.71073 Å |
Diffraction radiation type | MoKα |