Information card for entry 7242200
Formula |
C17 H21 N7 O4 |
Calculated formula |
C17 H21 N7 O4 |
Title of publication |
Supramolecular salts assembled by melamine and two organic hydroxyl acids: synthesis, structure, hydrogen bonds, and luminescent property |
Authors of publication |
Li, Fengcai; Xu, Hao; Xu, Xinwei; Cang, Hui; Xu, Jiaying; Chen, Song |
Journal of publication |
CrystEngComm |
Year of publication |
2021 |
Journal volume |
23 |
Journal issue |
11 |
Pages of publication |
2235 - 2248 |
a |
7.0401 ± 0.0002 Å |
b |
21.032 ± 0.0008 Å |
c |
12.0394 ± 0.0005 Å |
α |
90° |
β |
90.15 ± 0.012° |
γ |
90° |
Cell volume |
1782.64 ± 0.11 Å3 |
Cell temperature |
110 ± 2 K |
Ambient diffraction temperature |
110 K |
Number of distinct elements |
4 |
Space group number |
14 |
Hermann-Mauguin space group symbol |
P 1 21/c 1 |
Hall space group symbol |
-P 2ybc |
Residual factor for all reflections |
0.1197 |
Residual factor for significantly intense reflections |
0.0578 |
Weighted residual factors for significantly intense reflections |
0.1155 |
Weighted residual factors for all reflections included in the refinement |
0.1435 |
Goodness-of-fit parameter for all reflections included in the refinement |
1.047 |
Diffraction radiation wavelength |
0.71073 Å |
Diffraction radiation type |
MoKα |
Yes |
Yes |
No |