Information card for entry 7242210
Formula | C22 H14 Eu2 N6 O14 |
Calculated formula | C22 H14 Eu2 N6 O14 |
Title of publication | Syntheses of a series of lanthanide metal‒organic frameworks for efficient UV-light-driven dye degradation: experiment and simulation |
Authors of publication | Yuan, Fei; Ma, Hai-Xia; Yuan, Chun-Mei; Zhou, Chun-Sheng; Hu, Huai-Ming; Kumar, Abhinav; Muddassir, Mohd |
Journal of publication | CrystEngComm |
Year of publication | 2021 |
Journal volume | 23 |
Journal issue | 12 |
Pages of publication | 2404 - 2413 |
a | 9.5741 ± 0.0008 Å |
b | 18.3271 ± 0.0015 Å |
c | 6.7762 ± 0.0006 Å |
α | 90° |
β | 100.057 ± 0.001° |
γ | 90° |
Cell volume | 1170.72 ± 0.17 Å3 |
Cell temperature | 296 ± 2 K |
Ambient diffraction temperature | 296 ± 2 K |
Number of distinct elements | 5 |
Space group number | 14 |
Hermann-Mauguin space group symbol | P 1 21/c 1 |
Hall space group symbol | -P 2ybc |
Residual factor for all reflections | 0.022 |
Residual factor for significantly intense reflections | 0.0203 |
Weighted residual factors for significantly intense reflections | 0.0454 |
Weighted residual factors for all reflections included in the refinement | 0.0461 |
Goodness-of-fit parameter for all reflections included in the refinement | 1.085 |
Diffraction radiation wavelength | 0.71073 Å |
Diffraction radiation type | MoKα |