Information card for entry 7242306
Common name | BHDB |
Chemical name | 5,5?-bis(4-hydroxyphenyl)-2,2?-dihydroxy-1,1?-biphenyl |
Formula | C24 H18 O4 |
Calculated formula | C24 H18 O4 |
Title of publication | Interplay between the crystal stability and the energy of the molecular conformation |
Authors of publication | Dyk, Konrad; Baran, Łukasz; Rżysko, Wojciech; Stankevič, Marek; Kamiński, Daniel M. |
Journal of publication | CrystEngComm |
Year of publication | 2021 |
Journal volume | 23 |
Journal issue | 14 |
Pages of publication | 2683 - 2694 |
a | 36.4661 ± 0.0005 Å |
b | 36.4661 ± 0.0005 Å |
c | 36.4661 ± 0.0005 Å |
α | 90° |
β | 90° |
γ | 90° |
Cell volume | 48491.8 ± 1.2 Å3 |
Cell temperature | 293 K |
Ambient diffraction temperature | 293 K |
Number of distinct elements | 3 |
Space group number | 228 |
Hermann-Mauguin space group symbol | F d -3 c :2 |
Hall space group symbol | -F 4ud 2vw 3 |
Residual factor for all reflections | 0.0634 |
Residual factor for significantly intense reflections | 0.0537 |
Weighted residual factors for significantly intense reflections | 0.1678 |
Weighted residual factors for all reflections included in the refinement | 0.1811 |
Goodness-of-fit parameter for all reflections included in the refinement | 1.072 |
Diffraction radiation probe | x-ray |
Diffraction radiation wavelength | 1.54184 Å |
Diffraction radiation type | CuKα |