Information card for entry 7242308
Common name | DHBD |
Chemical name | 5,5?-bis(4-hydroxyphenyl)-2,2?-dihydroxy-1,1?-biphenyl |
Formula | C24 H18 O4 |
Calculated formula | C24 H18 O4 |
Title of publication | Interplay between the crystal stability and the energy of the molecular conformation |
Authors of publication | Dyk, Konrad; Baran, Łukasz; Rżysko, Wojciech; Stankevič, Marek; Kamiński, Daniel M. |
Journal of publication | CrystEngComm |
Year of publication | 2021 |
Journal volume | 23 |
Journal issue | 14 |
Pages of publication | 2683 - 2694 |
a | 20.3982 ± 0.0004 Å |
b | 8.72673 ± 0.0002 Å |
c | 9.6682 ± 0.0002 Å |
α | 90° |
β | 95.154 ± 0.002° |
γ | 90° |
Cell volume | 1714.07 ± 0.06 Å3 |
Cell temperature | 120.1 ± 0.1 K |
Ambient diffraction temperature | 120.1 ± 0.1 K |
Number of distinct elements | 3 |
Space group number | 15 |
Hermann-Mauguin space group symbol | C 1 2/c 1 |
Hall space group symbol | -C 2yc |
Residual factor for all reflections | 0.0375 |
Residual factor for significantly intense reflections | 0.0354 |
Weighted residual factors for significantly intense reflections | 0.0952 |
Weighted residual factors for all reflections included in the refinement | 0.0975 |
Goodness-of-fit parameter for all reflections included in the refinement | 1.063 |
Diffraction radiation probe | x-ray |
Diffraction radiation wavelength | 1.54184 Å |
Diffraction radiation type | CuKα |