Information card for entry 7242312
Formula | C12 H8 Mn N6 O5 |
Calculated formula | C12 H8 Mn N6 O5 |
Title of publication | Three Mn(ii) metal‒organic frameworks with the same chemical composition, but different topological structures and properties |
Authors of publication | Ma, Zhi Long; Wang, Meng Chen; Shi, Jian Yun; Tian, Li |
Journal of publication | CrystEngComm |
Year of publication | 2021 |
Journal volume | 23 |
Journal issue | 12 |
Pages of publication | 2396 - 2403 |
a | 21.4986 ± 0.001 Å |
b | 7.1737 ± 0.0003 Å |
c | 17.4036 ± 0.0008 Å |
α | 90° |
β | 93.698 ± 0.004° |
γ | 90° |
Cell volume | 2678.5 ± 0.2 Å3 |
Cell temperature | 140 ± 0.7 K |
Ambient diffraction temperature | 140 ± 0.7 K |
Number of distinct elements | 5 |
Space group number | 15 |
Hermann-Mauguin space group symbol | C 1 2/c 1 |
Hall space group symbol | -C 2yc |
Residual factor for all reflections | 0.0317 |
Residual factor for significantly intense reflections | 0.0262 |
Weighted residual factors for significantly intense reflections | 0.0657 |
Weighted residual factors for all reflections included in the refinement | 0.0686 |
Goodness-of-fit parameter for all reflections included in the refinement | 1.03 |
Diffraction radiation probe | x-ray |
Diffraction radiation wavelength | 0.71073 Å |
Diffraction radiation type | MoKα |