Information card for entry 7242317
Formula | C10 H20 I4 N2 |
Calculated formula | C10 H20 I4 N2 |
Title of publication | Synthesis and supramolecular organization of the iodide and triiodides of a polycyclic adamantane-based diammonium cation: the effects of hydrogen bonds and weak I⋯I interactions |
Authors of publication | Mezentsev-Cherkes, Ivan A.; Shestimerova, Tatiana A.; Medved'ko, Aleksei V.; Kalinin, Mikhail A.; Kuznetsov, Alexey N.; Wei, Zheng; Dikarev, Evgeny V.; Vatsadze, Sergey Z.; Shevelkov, Andrei V. |
Journal of publication | CrystEngComm |
Year of publication | 2021 |
Journal volume | 23 |
Journal issue | 12 |
Pages of publication | 2384 - 2395 |
a | 8.1345 ± 0.0012 Å |
b | 8.6866 ± 0.0016 Å |
c | 13.065 ± 0.001 Å |
α | 95.775 ± 0.009° |
β | 98.828 ± 0.01° |
γ | 96.093 ± 0.01° |
Cell volume | 900.7 ± 0.2 Å3 |
Cell temperature | 293 ± 2 K |
Ambient diffraction temperature | 293 ± 2 K |
Number of distinct elements | 4 |
Space group number | 2 |
Hermann-Mauguin space group symbol | P -1 |
Hall space group symbol | -P 1 |
Residual factor for all reflections | 0.2991 |
Residual factor for significantly intense reflections | 0.052 |
Weighted residual factors for significantly intense reflections | 0.1192 |
Weighted residual factors for all reflections included in the refinement | 0.2235 |
Goodness-of-fit parameter for all reflections included in the refinement | 0.596 |
Diffraction radiation wavelength | 0.71073 Å |
Diffraction radiation type | MoKα |