Information card for entry 7242319
Chemical name | 2,5-bis(4-((2,7-diethyl-9H-fluoren-9-ylidene)methyl)phenyl)thiophene |
Formula | C52 H44 S |
Calculated formula | C52 H44 S |
Title of publication | Alkyl-substituted bis(4-((9H-fluoren-9-ylidene)methyl)phenyl)thiophenes: weakening of intermolecular interactions and additive-assisted crystallization |
Authors of publication | Sonina, Alina A.; Becker, Christina S.; Kuimov, Anatoly D.; Shundrina, Inna K.; Komarov, Vladislav Yu.; Kazantsev, Maxim S. |
Journal of publication | CrystEngComm |
Year of publication | 2021 |
Journal volume | 23 |
Journal issue | 14 |
Pages of publication | 2654 - 2664 |
a | 16.581 ± 0.006 Å |
b | 9.216 ± 0.003 Å |
c | 25.101 ± 0.009 Å |
α | 90° |
β | 90.099 ± 0.011° |
γ | 90° |
Cell volume | 3836 ± 2 Å3 |
Cell temperature | 200 ± 1 K |
Ambient diffraction temperature | 200 ± 1 K |
Number of distinct elements | 3 |
Space group number | 4 |
Hermann-Mauguin space group symbol | P 1 21 1 |
Hall space group symbol | P 2yb |
Residual factor for all reflections | 0.0616 |
Residual factor for significantly intense reflections | 0.0464 |
Weighted residual factors for significantly intense reflections | 0.1073 |
Weighted residual factors for all reflections included in the refinement | 0.1203 |
Goodness-of-fit parameter for all reflections included in the refinement | 1.092 |
Diffraction radiation wavelength | 0.71073 Å |
Diffraction radiation type | MoKα |