Information card for entry 7242336
Formula | C22 H35 Cr Cu2 Mo6 N8 O24 |
Calculated formula | C22 H28 Cr Cu2 Mo6 N8 O24 |
Title of publication | A series of A- and B-type Anderson compounds with Al, Te and Cr as centers by tuning different ligands: syntheses, electrochemical, photocatalytic and CO2RR properties |
Authors of publication | Ying, Jun; Zhang, Baoyue; Tian, Aixiang; Wang, Xiuli |
Journal of publication | CrystEngComm |
Year of publication | 2021 |
Journal volume | 23 |
Journal issue | 13 |
Pages of publication | 2572 - 2581 |
a | 5.9548 ± 0.0007 Å |
b | 12.6735 ± 0.0015 Å |
c | 26.997 ± 0.003 Å |
α | 90° |
β | 91.812 ± 0.002° |
γ | 90° |
Cell volume | 2036.4 ± 0.4 Å3 |
Cell temperature | 296 ± 2 K |
Ambient diffraction temperature | 296.15 K |
Number of distinct elements | 7 |
Space group number | 14 |
Hermann-Mauguin space group symbol | P 1 21/c 1 |
Hall space group symbol | -P 2ybc |
Residual factor for all reflections | 0.058 |
Residual factor for significantly intense reflections | 0.0399 |
Weighted residual factors for significantly intense reflections | 0.0954 |
Weighted residual factors for all reflections included in the refinement | 0.1033 |
Goodness-of-fit parameter for all reflections included in the refinement | 1.015 |
Diffraction radiation wavelength | 0.71073 Å |
Diffraction radiation type | MoKα |