Information card for entry 7242349
Formula | C18 H12 F2 |
Calculated formula | C18 H12 F2 |
Title of publication | Exploration of CH⋯F & CF⋯H mediated supramolecular arrangements into fluorinated terphenyls and theoretical prediction of their third-order nonlinear optical response |
Authors of publication | Adeel, Muhammad; Khalid, Muhammad; Ullah, Malik Aman; Muhammad, Shabbir; Khan, Muhammad Usman; Tahir, Muhammad Nawaz; Khan, Ilham; Asghar, Muhammad; Mughal, Khawar Shahzad |
Journal of publication | RSC Advances |
Year of publication | 2021 |
Journal volume | 11 |
Journal issue | 14 |
Pages of publication | 7766 - 7778 |
a | 13.5172 ± 0.0012 Å |
b | 7.2166 ± 0.0005 Å |
c | 6.7331 ± 0.0006 Å |
α | 90° |
β | 96.411 ± 0.004° |
γ | 90° |
Cell volume | 652.69 ± 0.09 Å3 |
Cell temperature | 296 ± 2 K |
Ambient diffraction temperature | 296 ± 2 K |
Number of distinct elements | 3 |
Space group number | 14 |
Hermann-Mauguin space group symbol | P 1 21/c 1 |
Hall space group symbol | -P 2ybc |
Residual factor for all reflections | 0.0919 |
Residual factor for significantly intense reflections | 0.0749 |
Weighted residual factors for significantly intense reflections | 0.2028 |
Weighted residual factors for all reflections included in the refinement | 0.2269 |
Goodness-of-fit parameter for all reflections included in the refinement | 1.056 |
Diffraction radiation wavelength | 0.71073 Å |
Diffraction radiation type | MoKα |