Information card for entry 7242380
Formula | C52 H25 Dy3 N9 O20 |
Calculated formula | C52 H25 Dy3 N9 O20 |
Title of publication | Four anionic Ln-MOFs for remarkable separation of C2H2‒CH4/CO2‒CH4 and highly sensitive sensing of nitrobenzene |
Authors of publication | Zhan, Cai-Hong; Huang, Dan-Ping; Wang, Yu; Mao, Wei-Tao; Wang, Xiao-Juan; Jiang, Zhan-Guo; Feng, Yun-Long |
Journal of publication | CrystEngComm |
Year of publication | 2021 |
Journal volume | 23 |
Journal issue | 15 |
Pages of publication | 2788 - 2792 |
a | 19.12 ± 0.005 Å |
b | 28.411 ± 0.005 Å |
c | 15.383 ± 0.004 Å |
α | 90° |
β | 100.982 ± 0.018° |
γ | 90° |
Cell volume | 8203 ± 3 Å3 |
Cell temperature | 296 ± 2 K |
Ambient diffraction temperature | 296 ± 2 K |
Number of distinct elements | 5 |
Space group number | 12 |
Hermann-Mauguin space group symbol | C 1 2/m 1 |
Hall space group symbol | -C 2y |
Residual factor for all reflections | 0.1184 |
Residual factor for significantly intense reflections | 0.0985 |
Weighted residual factors for significantly intense reflections | 0.2263 |
Weighted residual factors for all reflections included in the refinement | 0.2391 |
Goodness-of-fit parameter for all reflections included in the refinement | 1.283 |
Diffraction radiation wavelength | 0.71073 Å |
Diffraction radiation type | MoKα |