Information card for entry 7242384
Chemical name | BDP-OH |
Formula | C32 H22 B F2 N3 O2 |
Calculated formula | C32 H22 B F2 N3 O2 |
Title of publication | A molecular design towards sulfonyl aza-BODIPY based NIR fluorescent and colorimetric probe for selective cysteine detection |
Authors of publication | Pham, Thanh Chung; Choi, Yeonghwan; Bae, Chaeeon; Tran, Cong So; Kim, Dongwon; Jung, Ok-Sang; Kang, Yong-Cheol; Seo, SungYong; Kim, Hyun Sung; Yun, Hwayoung; Zhou, Xin; Lee, Songyi |
Journal of publication | RSC Advances |
Year of publication | 2021 |
Journal volume | 11 |
Journal issue | 17 |
Pages of publication | 10154 - 10158 |
a | 11.263 ± 0.002 Å |
b | 12.253 ± 0.003 Å |
c | 36.822 ± 0.007 Å |
α | 90° |
β | 90° |
γ | 90° |
Cell volume | 5081.6 ± 1.8 Å3 |
Cell temperature | 225 ± 2 K |
Ambient diffraction temperature | 225 ± 2 K |
Number of distinct elements | 6 |
Space group number | 29 |
Hermann-Mauguin space group symbol | P c a 21 |
Hall space group symbol | P 2c -2ac |
Residual factor for all reflections | 0.0864 |
Residual factor for significantly intense reflections | 0.0537 |
Weighted residual factors for significantly intense reflections | 0.1316 |
Weighted residual factors for all reflections included in the refinement | 0.1458 |
Goodness-of-fit parameter for all reflections included in the refinement | 0.972 |
Diffraction radiation wavelength | 0.7 Å |
Diffraction radiation type | synchrotron |