Information card for entry 7242434
Formula | C20 H31 Br N Ni O6 S10 |
Calculated formula | C20 H31 Br N Ni O6 S10 |
Title of publication | Molecular motion of halogenated ethylammonium/[18]crown-6 supramolecular ions in nickel dithiolate magnetic crystals |
Authors of publication | Hasuo, Naohiro; Takahashi, Kiyonori; Hisaki, Ichiro; Kokado, Kenta; Nakamura, Takayoshi |
Journal of publication | CrystEngComm |
Year of publication | 2021 |
Journal volume | 23 |
Journal issue | 14 |
Pages of publication | 2756 - 2763 |
a | 10.9869 ± 0.0003 Å |
b | 12.0485 ± 0.0004 Å |
c | 13.7559 ± 0.0005 Å |
α | 115.833 ± 0.004° |
β | 91.587 ± 0.003° |
γ | 100.906 ± 0.003° |
Cell volume | 1596.83 ± 0.11 Å3 |
Cell temperature | 106 K |
Ambient diffraction temperature | 106 K |
Number of distinct elements | 7 |
Space group number | 2 |
Hermann-Mauguin space group symbol | P -1 |
Hall space group symbol | -P 1 |
Residual factor for all reflections | 0.0572 |
Residual factor for significantly intense reflections | 0.0356 |
Weighted residual factors for significantly intense reflections | 0.0703 |
Weighted residual factors for all reflections included in the refinement | 0.0757 |
Goodness-of-fit parameter for all reflections included in the refinement | 0.994 |
Diffraction radiation probe | x-ray |
Diffraction radiation wavelength | 0.71073 Å |
Diffraction radiation type | MoKα |