Information card for entry 7242439
Formula | C20 H31 Br N Ni O6 S10 |
Calculated formula | C20 H31 Br1.0001 N Ni O6 S10 |
Title of publication | Molecular motion of halogenated ethylammonium/[18]crown-6 supramolecular ions in nickel dithiolate magnetic crystals |
Authors of publication | Hasuo, Naohiro; Takahashi, Kiyonori; Hisaki, Ichiro; Kokado, Kenta; Nakamura, Takayoshi |
Journal of publication | CrystEngComm |
Year of publication | 2021 |
Journal volume | 23 |
Journal issue | 14 |
Pages of publication | 2756 - 2763 |
a | 11.0864 ± 0.0003 Å |
b | 12.0734 ± 0.0003 Å |
c | 13.7103 ± 0.0004 Å |
α | 65.253 ± 0.003° |
β | 80.773 ± 0.003° |
γ | 78.66 ± 0.002° |
Cell volume | 1627.78 ± 0.09 Å3 |
Cell temperature | 253 K |
Ambient diffraction temperature | 253 K |
Number of distinct elements | 7 |
Space group number | 2 |
Hermann-Mauguin space group symbol | P -1 |
Hall space group symbol | -P 1 |
Residual factor for all reflections | 0.0713 |
Residual factor for significantly intense reflections | 0.0377 |
Weighted residual factors for significantly intense reflections | 0.0875 |
Weighted residual factors for all reflections included in the refinement | 0.0967 |
Goodness-of-fit parameter for all reflections included in the refinement | 1.039 |
Diffraction radiation probe | x-ray |
Diffraction radiation wavelength | 0.71073 Å |
Diffraction radiation type | MoKα |