Information card for entry 7242455
Formula | C20 H31 Cl N Ni O6 S10 |
Calculated formula | C20 H31 Cl N Ni O6 S10 |
Title of publication | Molecular motion of halogenated ethylammonium/[18]crown-6 supramolecular ions in nickel dithiolate magnetic crystals |
Authors of publication | Hasuo, Naohiro; Takahashi, Kiyonori; Hisaki, Ichiro; Kokado, Kenta; Nakamura, Takayoshi |
Journal of publication | CrystEngComm |
Year of publication | 2021 |
Journal volume | 23 |
Journal issue | 14 |
Pages of publication | 2756 - 2763 |
a | 11.2452 ± 0.0002 Å |
b | 12.3442 ± 0.0002 Å |
c | 12.8113 ± 0.0002 Å |
α | 91.832 ± 0.001° |
β | 111.431 ± 0.001° |
γ | 96.243 ± 0.001° |
Cell volume | 1640.65 ± 0.05 Å3 |
Cell temperature | 173 K |
Ambient diffraction temperature | 173 K |
Number of distinct elements | 7 |
Space group number | 2 |
Hermann-Mauguin space group symbol | P -1 |
Hall space group symbol | -P 1 |
Residual factor for all reflections | 0.0367 |
Residual factor for significantly intense reflections | 0.0354 |
Weighted residual factors for significantly intense reflections | 0.0998 |
Weighted residual factors for all reflections included in the refinement | 0.1011 |
Goodness-of-fit parameter for all reflections included in the refinement | 1.027 |
Diffraction radiation probe | x-ray |
Diffraction radiation wavelength | 1.54184 Å |
Diffraction radiation type | CuKα |