Information card for entry 7242457
Formula | C20 H31 Cl N Ni O6 S10 |
Calculated formula | C20 H31 Cl N Ni O6 S10 |
Title of publication | Molecular motion of halogenated ethylammonium/[18]crown-6 supramolecular ions in nickel dithiolate magnetic crystals |
Authors of publication | Hasuo, Naohiro; Takahashi, Kiyonori; Hisaki, Ichiro; Kokado, Kenta; Nakamura, Takayoshi |
Journal of publication | CrystEngComm |
Year of publication | 2021 |
Journal volume | 23 |
Journal issue | 14 |
Pages of publication | 2756 - 2763 |
a | 11.2803 ± 0.0003 Å |
b | 12.3375 ± 0.0002 Å |
c | 12.8611 ± 0.0003 Å |
α | 91.103 ± 0.002° |
β | 110.634 ± 0.002° |
γ | 96.375 ± 0.002° |
Cell volume | 1661.43 ± 0.07 Å3 |
Cell temperature | 273 K |
Ambient diffraction temperature | 273 K |
Number of distinct elements | 7 |
Space group number | 2 |
Hermann-Mauguin space group symbol | P -1 |
Hall space group symbol | -P 1 |
Residual factor for all reflections | 0.0565 |
Residual factor for significantly intense reflections | 0.0389 |
Weighted residual factors for significantly intense reflections | 0.1292 |
Weighted residual factors for all reflections included in the refinement | 0.1449 |
Goodness-of-fit parameter for all reflections included in the refinement | 1.015 |
Diffraction radiation probe | x-ray |
Diffraction radiation wavelength | 0.71073 Å |
Diffraction radiation type | MoKα |