Information card for entry 7242460
Formula | C20 H31 Br N Ni O6 S10 |
Calculated formula | C20 H31 Br N Ni O6 S10 |
Title of publication | Molecular motion of halogenated ethylammonium/[18]crown-6 supramolecular ions in nickel dithiolate magnetic crystals |
Authors of publication | Hasuo, Naohiro; Takahashi, Kiyonori; Hisaki, Ichiro; Kokado, Kenta; Nakamura, Takayoshi |
Journal of publication | CrystEngComm |
Year of publication | 2021 |
Journal volume | 23 |
Journal issue | 14 |
Pages of publication | 2756 - 2763 |
a | 11.1694 ± 0.0004 Å |
b | 12.1413 ± 0.0004 Å |
c | 13.7408 ± 0.0006 Å |
α | 65.543 ± 0.004° |
β | 81.123 ± 0.003° |
γ | 78.362 ± 0.003° |
Cell volume | 1656.09 ± 0.12 Å3 |
Cell temperature | 313 K |
Ambient diffraction temperature | 313 K |
Number of distinct elements | 7 |
Space group number | 2 |
Hermann-Mauguin space group symbol | P -1 |
Hall space group symbol | -P 1 |
Residual factor for all reflections | 0.0783 |
Residual factor for significantly intense reflections | 0.0416 |
Weighted residual factors for significantly intense reflections | 0.0958 |
Weighted residual factors for all reflections included in the refinement | 0.1076 |
Goodness-of-fit parameter for all reflections included in the refinement | 1.049 |
Diffraction radiation probe | x-ray |
Diffraction radiation wavelength | 0.71073 Å |
Diffraction radiation type | MoKα |