Information card for entry 7242464
Formula | C20 H32 N Ni O6 S10 |
Calculated formula | C20 H32 N Ni O6 S10 |
SMILES | [Ni]12(SC3SC(=S)SC=3S2)SC2SC(=S)SC=2S1.O1CCOCCOCCOCCOCCOCC1.[NH3+]CC |
Title of publication | Molecular motion of halogenated ethylammonium/[18]crown-6 supramolecular ions in nickel dithiolate magnetic crystals |
Authors of publication | Hasuo, Naohiro; Takahashi, Kiyonori; Hisaki, Ichiro; Kokado, Kenta; Nakamura, Takayoshi |
Journal of publication | CrystEngComm |
Year of publication | 2021 |
Journal volume | 23 |
Journal issue | 14 |
Pages of publication | 2756 - 2763 |
a | 11.1765 ± 0.0004 Å |
b | 12.2812 ± 0.0003 Å |
c | 12.6527 ± 0.0004 Å |
α | 87.364 ± 0.002° |
β | 68.465 ± 0.003° |
γ | 80.094 ± 0.002° |
Cell volume | 1591.12 ± 0.09 Å3 |
Cell temperature | 113 K |
Ambient diffraction temperature | 113 K |
Number of distinct elements | 6 |
Space group number | 2 |
Hermann-Mauguin space group symbol | P -1 |
Hall space group symbol | -P 1 |
Residual factor for all reflections | 0.0427 |
Residual factor for significantly intense reflections | 0.0357 |
Weighted residual factors for significantly intense reflections | 0.0936 |
Weighted residual factors for all reflections included in the refinement | 0.0981 |
Goodness-of-fit parameter for all reflections included in the refinement | 1.05 |
Diffraction radiation probe | x-ray |
Diffraction radiation wavelength | 0.71073 Å |
Diffraction radiation type | MoKα |