Information card for entry 7242474
Formula | C20 H31 F N Ni O6 S10 |
Calculated formula | C20 H31 F N Ni O6 S10 |
Title of publication | Molecular motion of halogenated ethylammonium/[18]crown-6 supramolecular ions in nickel dithiolate magnetic crystals |
Authors of publication | Hasuo, Naohiro; Takahashi, Kiyonori; Hisaki, Ichiro; Kokado, Kenta; Nakamura, Takayoshi |
Journal of publication | CrystEngComm |
Year of publication | 2021 |
Journal volume | 23 |
Journal issue | 14 |
Pages of publication | 2756 - 2763 |
a | 10.4204 ± 0.0003 Å |
b | 12.6319 ± 0.0004 Å |
c | 12.9511 ± 0.0004 Å |
α | 70.735 ± 0.003° |
β | 79.898 ± 0.002° |
γ | 80.25 ± 0.002° |
Cell volume | 1572.9 ± 0.09 Å3 |
Cell temperature | 193 K |
Ambient diffraction temperature | 193 K |
Number of distinct elements | 7 |
Space group number | 2 |
Hermann-Mauguin space group symbol | P -1 |
Hall space group symbol | -P 1 |
Residual factor for all reflections | 0.057 |
Residual factor for significantly intense reflections | 0.0414 |
Weighted residual factors for significantly intense reflections | 0.1011 |
Weighted residual factors for all reflections included in the refinement | 0.1094 |
Goodness-of-fit parameter for all reflections included in the refinement | 1.016 |
Diffraction radiation probe | x-ray |
Diffraction radiation wavelength | 0.71073 Å |
Diffraction radiation type | MoKα |