Information card for entry 7242480
Formula | C20 H31 F N Ni O6 S10 |
Calculated formula | C20 H31 F N Ni O6 S10 |
Title of publication | Molecular motion of halogenated ethylammonium/[18]crown-6 supramolecular ions in nickel dithiolate magnetic crystals |
Authors of publication | Hasuo, Naohiro; Takahashi, Kiyonori; Hisaki, Ichiro; Kokado, Kenta; Nakamura, Takayoshi |
Journal of publication | CrystEngComm |
Year of publication | 2021 |
Journal volume | 23 |
Journal issue | 14 |
Pages of publication | 2756 - 2763 |
a | 10.5673 ± 0.0004 Å |
b | 12.6724 ± 0.0004 Å |
c | 13.0358 ± 0.0006 Å |
α | 72.219 ± 0.004° |
β | 79.801 ± 0.004° |
γ | 81.293 ± 0.003° |
Cell volume | 1627.17 ± 0.12 Å3 |
Cell temperature | 353 K |
Ambient diffraction temperature | 353 K |
Number of distinct elements | 7 |
Space group number | 2 |
Hermann-Mauguin space group symbol | P -1 |
Hall space group symbol | -P 1 |
Residual factor for all reflections | 0.071 |
Residual factor for significantly intense reflections | 0.0459 |
Weighted residual factors for significantly intense reflections | 0.1373 |
Weighted residual factors for all reflections included in the refinement | 0.1559 |
Goodness-of-fit parameter for all reflections included in the refinement | 0.911 |
Diffraction radiation probe | x-ray |
Diffraction radiation wavelength | 0.71073 Å |
Diffraction radiation type | MoKα |