Information card for entry 7242501
Formula | C10.25 H13 Cu0.5 O5.25 |
Calculated formula | C10.25 H13 Cu0.5 O5.25 |
Title of publication | A novel two-dimensional metal‒organic framework as a recyclable heterogeneous catalyst for the dehydrogenative oxidation of alcohol and the N-arylation of azole compounds |
Authors of publication | Liu, Chengxin; Cui, Jin; Wang, Yufang; Zhang, Mingjie |
Journal of publication | RSC Advances |
Year of publication | 2021 |
Journal volume | 11 |
Journal issue | 19 |
Pages of publication | 11739 - 11744 |
a | 19.149 ± 0.004 Å |
b | 10.772 ± 0.002 Å |
c | 23.154 ± 0.005 Å |
α | 90° |
β | 90° |
γ | 90° |
Cell volume | 4776 ± 1.7 Å3 |
Cell temperature | 113.15 K |
Ambient diffraction temperature | 113.15 K |
Number of distinct elements | 4 |
Space group number | 64 |
Hermann-Mauguin space group symbol | C m c e |
Hall space group symbol | -C 2ac 2 |
Residual factor for all reflections | 0.0957 |
Residual factor for significantly intense reflections | 0.0903 |
Weighted residual factors for significantly intense reflections | 0.2145 |
Weighted residual factors for all reflections included in the refinement | 0.2176 |
Goodness-of-fit parameter for all reflections included in the refinement | 1.151 |
Diffraction radiation wavelength | 0.71073 Å |
Diffraction radiation type | MoKα |