Information card for entry 7242515
Formula | C34 H30 Cl2 Fe2 Mn N0 O7 |
Calculated formula | C34 H30 Cl2 Fe2 Mn O7 |
Title of publication | Structural diversity and magnetic properties of six ferrocenyl monocarboxylate Mn(ii), Ni(ii) and Co(ii) complexes with 1D aqua, carboxyl or dinuclear hydroxyl bridges |
Authors of publication | Khan, Misbha Rafiq; Niu, Xiaoge; Chen, Tianling; Liu, Yan; Liu, Zhongyi; Liu, Bin; Zhang, Yuxia; Li, Jinpeng |
Journal of publication | CrystEngComm |
Year of publication | 2021 |
Journal volume | 23 |
Journal issue | 17 |
Pages of publication | 3185 - 3195 |
a | 45.506 ± 0.009 Å |
b | 9.888 ± 0.002 Å |
c | 8.1578 ± 0.0016 Å |
α | 90° |
β | 93.89 ± 0.03° |
γ | 90° |
Cell volume | 3662.3 ± 1.3 Å3 |
Cell temperature | 293 ± 2 K |
Ambient diffraction temperature | 293 ± 2 K |
Number of distinct elements | 7 |
Space group number | 15 |
Hermann-Mauguin space group symbol | C 1 2/c 1 |
Hall space group symbol | -C 2yc |
Residual factor for all reflections | 0.0803 |
Residual factor for significantly intense reflections | 0.0733 |
Weighted residual factors for significantly intense reflections | 0.194 |
Weighted residual factors for all reflections included in the refinement | 0.2014 |
Goodness-of-fit parameter for all reflections included in the refinement | 1.287 |
Diffraction radiation wavelength | 0.71073 Å |
Diffraction radiation type | MoKα |