Information card for entry 7242517
Formula | C34 H26 Cl2 Fe2 N0 Ni O7 |
Calculated formula | C34 H26 Cl2 Fe2 Ni O7 |
Title of publication | Structural diversity and magnetic properties of six ferrocenyl monocarboxylate Mn(ii), Ni(ii) and Co(ii) complexes with 1D aqua, carboxyl or dinuclear hydroxyl bridges |
Authors of publication | Khan, Misbha Rafiq; Niu, Xiaoge; Chen, Tianling; Liu, Yan; Liu, Zhongyi; Liu, Bin; Zhang, Yuxia; Li, Jinpeng |
Journal of publication | CrystEngComm |
Year of publication | 2021 |
Journal volume | 23 |
Journal issue | 17 |
Pages of publication | 3185 - 3195 |
a | 45.368 ± 0.009 Å |
b | 9.959 ± 0.002 Å |
c | 8.0659 ± 0.0016 Å |
α | 90° |
β | 94.54 ± 0.03° |
γ | 90° |
Cell volume | 3632.9 ± 1.3 Å3 |
Cell temperature | 293 ± 2 K |
Ambient diffraction temperature | 293 ± 2 K |
Number of distinct elements | 7 |
Space group number | 15 |
Hermann-Mauguin space group symbol | C 1 2/c 1 |
Hall space group symbol | -C 2yc |
Residual factor for all reflections | 0.094 |
Residual factor for significantly intense reflections | 0.0697 |
Weighted residual factors for significantly intense reflections | 0.1776 |
Weighted residual factors for all reflections included in the refinement | 0.1999 |
Goodness-of-fit parameter for all reflections included in the refinement | 0.934 |
Diffraction radiation wavelength | 0.71073 Å |
Diffraction radiation type | MoKα |