Information card for entry 7242519
Formula | C34 H24 Cl2 Co Fe2 N0 O7 |
Calculated formula | C34 H24 Cl2 Co Fe2 O7 |
Title of publication | Structural diversity and magnetic properties of six ferrocenyl monocarboxylate Mn(ii), Ni(ii) and Co(ii) complexes with 1D aqua, carboxyl or dinuclear hydroxyl bridges |
Authors of publication | Khan, Misbha Rafiq; Niu, Xiaoge; Chen, Tianling; Liu, Yan; Liu, Zhongyi; Liu, Bin; Zhang, Yuxia; Li, Jinpeng |
Journal of publication | CrystEngComm |
Year of publication | 2021 |
Journal volume | 23 |
Journal issue | 17 |
Pages of publication | 3185 - 3195 |
a | 45.267 ± 0.009 Å |
b | 9.929 ± 0.002 Å |
c | 8.0513 ± 0.0016 Å |
α | 90° |
β | 94.33 ± 0.03° |
γ | 90° |
Cell volume | 3608.4 ± 1.3 Å3 |
Cell temperature | 293 ± 2 K |
Ambient diffraction temperature | 293 ± 2 K |
Number of distinct elements | 7 |
Space group number | 15 |
Hermann-Mauguin space group symbol | C 1 2/c 1 |
Hall space group symbol | -C 2yc |
Residual factor for all reflections | 0.0714 |
Residual factor for significantly intense reflections | 0.0664 |
Weighted residual factors for significantly intense reflections | 0.1662 |
Weighted residual factors for all reflections included in the refinement | 0.1727 |
Goodness-of-fit parameter for all reflections included in the refinement | 1.003 |
Diffraction radiation wavelength | 0.71073 Å |
Diffraction radiation type | MoKα |