Information card for entry 7242529
Formula | C64 H116 Bi2 Li4 N2 O20 |
Calculated formula | C64 H116 Bi2 Li4 N2 O20 |
Title of publication | Heterobimetallic complexes composed of bismuth and lithium carboxylates as polyurethane catalysts ‒ alternatives to organotin compounds |
Authors of publication | Levent, Emre; Sala, Oliver; Wilm, Lukas F. B.; Löwe, Pawel; Dielmann, Fabian |
Journal of publication | Green Chemistry |
Year of publication | 2021 |
Journal volume | 23 |
Journal issue | 7 |
Pages of publication | 2747 - 2755 |
a | 14.3713 ± 0.0002 Å |
b | 17.9791 ± 0.0002 Å |
c | 15.3608 ± 0.0002 Å |
α | 90° |
β | 92.508 ± 0.001° |
γ | 90° |
Cell volume | 3965.17 ± 0.09 Å3 |
Cell temperature | 100 ± 2 K |
Ambient diffraction temperature | 100 K |
Number of distinct elements | 6 |
Space group number | 14 |
Hermann-Mauguin space group symbol | P 1 21/n 1 |
Hall space group symbol | -P 2yn |
Residual factor for all reflections | 0.0224 |
Residual factor for significantly intense reflections | 0.0182 |
Weighted residual factors for significantly intense reflections | 0.0413 |
Weighted residual factors for all reflections included in the refinement | 0.0429 |
Goodness-of-fit parameter for all reflections included in the refinement | 1.012 |
Diffraction radiation wavelength | 0.71073 Å |
Diffraction radiation type | MoKα |