Information card for entry 7242537
Formula | C16 H12 F O2 |
Calculated formula | C16 H12 F2 O |
Title of publication | Fluorine as a robust balancer for tuning the reactivity of topo-photoreactions of chalcones and the photomechanical effects of molecular crystals |
Authors of publication | Shu, Yuanhong; Ye, Kaiqi; Yue, Yuan; Sun, Jingbo; Wang, Haoran; Zhong, Jiangbin; Yang, Xiqiao; Gao, Hongqiang; Lu, Ran |
Journal of publication | CrystEngComm |
Year of publication | 2021 |
Journal volume | 23 |
Journal issue | 34 |
Pages of publication | 5856 - 5868 |
a | 5.6819 ± 0.0005 Å |
b | 7.7529 ± 0.0007 Å |
c | 14.9654 ± 0.0012 Å |
α | 93.713 ± 0.003° |
β | 97.789 ± 0.003° |
γ | 95.423 ± 0.003° |
Cell volume | 648.22 ± 0.1 Å3 |
Cell temperature | 100 ± 2 K |
Ambient diffraction temperature | 100 K |
Number of distinct elements | 4 |
Space group number | 2 |
Hermann-Mauguin space group symbol | P -1 |
Hall space group symbol | -P 1 |
Residual factor for all reflections | 0.1175 |
Residual factor for significantly intense reflections | 0.056 |
Weighted residual factors for significantly intense reflections | 0.1084 |
Weighted residual factors for all reflections included in the refinement | 0.1353 |
Goodness-of-fit parameter for all reflections included in the refinement | 1.021 |
Diffraction radiation wavelength | 0.71073 Å |
Diffraction radiation type | MoKα |