Information card for entry 7242540
Formula | C15 H9 F3 O |
Calculated formula | C15 H9 F3 O |
SMILES | Fc1ccc(C(=O)/C=C/c2cc(F)cc(F)c2)cc1 |
Title of publication | Fluorine as a robust balancer for tuning the reactivity of topo-photoreactions of chalcones and the photomechanical effects of molecular crystals |
Authors of publication | Shu, Yuanhong; Ye, Kaiqi; Yue, Yuan; Sun, Jingbo; Wang, Haoran; Zhong, Jiangbin; Yang, Xiqiao; Gao, Hongqiang; Lu, Ran |
Journal of publication | CrystEngComm |
Year of publication | 2021 |
Journal volume | 23 |
Journal issue | 34 |
Pages of publication | 5856 - 5868 |
a | 13.9052 ± 0.0011 Å |
b | 3.7985 ± 0.0003 Å |
c | 23.3553 ± 0.0018 Å |
α | 90° |
β | 105.147 ± 0.005° |
γ | 90° |
Cell volume | 1190.74 ± 0.16 Å3 |
Cell temperature | 100 ± 2 K |
Ambient diffraction temperature | 100 K |
Number of distinct elements | 4 |
Space group number | 14 |
Hermann-Mauguin space group symbol | P 1 21/c 1 |
Hall space group symbol | -P 2ybc |
Residual factor for all reflections | 0.1904 |
Residual factor for significantly intense reflections | 0.1028 |
Weighted residual factors for significantly intense reflections | 0.1856 |
Weighted residual factors for all reflections included in the refinement | 0.2145 |
Goodness-of-fit parameter for all reflections included in the refinement | 1.211 |
Diffraction radiation wavelength | 0.71073 Å |
Diffraction radiation type | MoKα |