Information card for entry 7242543
Formula | C32 H24 F4 O2 |
Calculated formula | C32 H24 F4 O2 |
Title of publication | Fluorine as a robust balancer for tuning the reactivity of topo-photoreactions of chalcones and the photomechanical effects of molecular crystals |
Authors of publication | Shu, Yuanhong; Ye, Kaiqi; Yue, Yuan; Sun, Jingbo; Wang, Haoran; Zhong, Jiangbin; Yang, Xiqiao; Gao, Hongqiang; Lu, Ran |
Journal of publication | CrystEngComm |
Year of publication | 2021 |
Journal volume | 23 |
Journal issue | 34 |
Pages of publication | 5856 - 5868 |
a | 5.9906 ± 0.0011 Å |
b | 26.824 ± 0.006 Å |
c | 8.121 ± 0.0018 Å |
α | 90° |
β | 100.511 ± 0.005° |
γ | 90° |
Cell volume | 1283.1 ± 0.5 Å3 |
Cell temperature | 144 ± 2 K |
Ambient diffraction temperature | 144.53 K |
Number of distinct elements | 4 |
Space group number | 14 |
Hermann-Mauguin space group symbol | P 1 21/n 1 |
Hall space group symbol | -P 2yn |
Residual factor for all reflections | 0.1433 |
Residual factor for significantly intense reflections | 0.0848 |
Weighted residual factors for significantly intense reflections | 0.2171 |
Weighted residual factors for all reflections included in the refinement | 0.27 |
Goodness-of-fit parameter for all reflections included in the refinement | 1.002 |
Diffraction radiation wavelength | 0.71073 Å |
Diffraction radiation type | MoKα |