Information card for entry 7242546
Formula | C15 H11 F O |
Calculated formula | C15 H11 F O |
SMILES | Fc1ccc(/C=C/C(=O)c2ccccc2)cc1 |
Title of publication | Fluorine as a robust balancer for tuning the reactivity of topo-photoreactions of chalcones and the photomechanical effects of molecular crystals |
Authors of publication | Shu, Yuanhong; Ye, Kaiqi; Yue, Yuan; Sun, Jingbo; Wang, Haoran; Zhong, Jiangbin; Yang, Xiqiao; Gao, Hongqiang; Lu, Ran |
Journal of publication | CrystEngComm |
Year of publication | 2021 |
Journal volume | 23 |
Journal issue | 34 |
Pages of publication | 5856 - 5868 |
a | 25.053 ± 0.003 Å |
b | 5.7339 ± 0.0008 Å |
c | 8.0226 ± 0.001 Å |
α | 90° |
β | 95.745 ± 0.005° |
γ | 90° |
Cell volume | 1146.7 ± 0.3 Å3 |
Cell temperature | 100 ± 2 K |
Ambient diffraction temperature | 100.15 K |
Number of distinct elements | 4 |
Space group number | 9 |
Hermann-Mauguin space group symbol | C 1 c 1 |
Hall space group symbol | C -2yc |
Residual factor for all reflections | 0.0632 |
Residual factor for significantly intense reflections | 0.0425 |
Weighted residual factors for significantly intense reflections | 0.0787 |
Weighted residual factors for all reflections included in the refinement | 0.0856 |
Goodness-of-fit parameter for all reflections included in the refinement | 1.051 |
Diffraction radiation wavelength | 0.71073 Å |
Diffraction radiation type | MoKα |